{"text_format":"1","workbook":"xlsx","n_sheets":4,"sheets":["Instructions","Bore Register","Dropdowns","Validation"],"not_rendered":{"charts":0,"images":0,"macros":0,"external_links":0,"defined_names":21,"comments":0,"pivot_tables":0},"unopened":[],"bounds":{"document_bytes":16777216,"sheet_cells":100000,"rows_first":2000,"rows_last":500,"rows_between":2000,"halvings":0,"cell_chars":16384,"cell_head_chars":4096},"cells_cut":0,"cells_raw":0,"read":"whole","date_system":"1900"}

{"sheet":"Instructions","index":0,"n_rows":20,"n_cols":10,"rows_kept":20,"cut":false,"hidden":false,"merged":[[19,4,19,5],[5,13,12,13],[10,7,11,7],[9,9,12,9],[17,4,17,5],[18,4,18,5]]}
[]
[null,"BR Instructions/Guidelines"]
[null,"Version 0.1.1"]
[null,"Revision P, released 24 July 2023"]
[]
[]
[null,null,null,null,null,null,null,"DATA CHECKS",null,"GIS REQUIREMENTS (SPECIFIC)"]
[null,null,"Bore Register"]
[]
[null,null,null,"Enter monitoring bores, noting each row should contain a unique Bore ID",null,null,null,null,null,"Coordinates must be listed within this register, GIS layers are not required. "]
{"$rows_left_out":11}
{"sheet":"Bore Register","index":1,"n_rows":16,"n_cols":18,"rows_kept":16,"cut":false,"hidden":false,"merged":[[3,2,3,9],[3,10,3,11],[3,0,3,1],[3,12,3,17]]}
["source_supersede",null,null,"bore_type",null,"bore_status",null,"headworks",null,null,"railmap",null,null,null,"bore_crs"]
["record_type","bore_id","bore_name","bore_type","bore_owner","bore_status","license_id","headworks","screen_int","installed_year","site_desc","lot_desc","easting","northing","coordinate_system","TOC","ground_level","top_of_gatic"]
[{"$f":"VLOOKUP(A$2, validate_Bores[], 7, FALSE)","v":"Dropdown*"},{"$f":"VLOOKUP(B$2, validate_Bores[], 7, FALSE)","v":"Whole Number"},{"$f":"VLOOKUP(C$2, validate_Bores[], 7, FALSE)","v":"Free text (50 characters)*"},{"$f":"VLOOKUP(D$2, validate_Bores[], 7, FALSE)","v":"Dropdown*"},{"$f":"VLOOKUP(E$2, validate_Bores[], 7, FALSE)","v":"Free text (100 characters)*"},{"$f":"VLOOKUP(F$2, validate_Bores[], 7, FALSE)","v":"Dropdown*"},{"$f":"VLOOKUP(G$2, validate_Bores[], 7, FALSE)","v":"Free text (20 characters)"},{"$f":"VLOOKUP(H$2, validate_Bores[], 7, FALSE)","v":"Dropdown"},{"$f":"VLOOKUP(I$2, validate_Bores[], 7, FALSE)","v":"Free text (20 characters)"},{"$f":"VLOOKUP(J$2, validate_Bores[], 7, FALSE)","v":"Free text (20 characters)"},{"$f":"VLOOKUP(K$2, validate_Bores[], 7, FALSE)","v":"Dropdown*"},{"$f":"VLOOKUP(L$2, validate_Bores[], 7, FALSE)","v":"Free text (50 characters)"},{"$f":"VLOOKUP(M$2, validate_Bores[], 7, FALSE)","v":"Decimal Number*"},{"$f":"VLOOKUP(N$2, validate_Bores[], 7, FALSE)","v":"Decimal Number*"},{"$f":"VLOOKUP(O$2, validate_Bores[], 7, FALSE)","v":"Dropdown*"},{"$f":"VLOOKUP(P$2, validate_Bores[], 7, FALSE)","v":"Decimal Number*"},{"$f":"VLOOKUP(Q$2, validate_Bores[], 7, FALSE)","v":"Decimal Number"},{"$f":"VLOOKUP(R$2, validate_Bores[], 7, FALSE)","v":"Decimal Number"}]
["Supersede previous bore",null,"Bore Information",null,null,null,null,null,null,null,"VicTrack Location",null,"Survey Data"]
["Does this Bore record replace an existing Bore ID?","CHAMP BORE ID\n(if the record replaces an existing bore)","Unique Bore ID","Bore Type","Bore Owner","Bore Status","BCL ID","Headworks","Screen Interval (m bgL)","Installed Year","RailMap Site Location","RailMap Lot ID/RIL","Eastings ","Northings","Coordinate System","TOC","Ground Level","Top of gatic"]
[]
[]
[]
[]
[]
{"$rows_left_out":7}
{"sheet":"Dropdowns","index":2,"n_rows":1026,"n_cols":6,"rows_kept":1026,"cut":false,"hidden":true,"merged":[]}
["railmap","bore_type","bore_crs","headworks","bore_status","source_supersede"]
["RailMap Location","Bore Type  Dropdown","Coordinate System","Bore Headworks (Surface Construction)","Bore Status","Register Supersedence"]
["ADELAIDE LEAD","VicTrack groundwater","AGD66 (lat long)","Standpipe","Active","Yes"]
["AIRCRAFT","Third-party groundwater","AGD84 (lat long)","Flush","Decomissioned","No - first entry"]
["AIRPORT WEST","VicTrack vapour/gas","GDA2020 (lat long)",null,"Lost/Destroyed","No - same as previous"]
["AIRPORT WEST SUBSTN","Third-party vapour/gas","GDA94 (lat long)"]
["ALAMEIN",null,"WGS (lat long)"]
["ALBACUTYA",null,"AMG66 z54"]
["ALBERT PARK",null,"AMG66 z55"]
["ALBION",null,"AMG84 z54"]
{"$rows_left_out":1017}
{"sheet":"Validation","index":3,"n_rows":47,"n_cols":24,"rows_kept":47,"cut":false,"hidden":true,"merged":[]}
["SOURCE_REGISTER",null,{"$f":"ROWS(INDIRECT(A1))-E1","v":{"$error":"#REF!"}},"total rows (minus blank)",{"$f":"COUNTIFS(INDIRECT($A$1&\"[\"&C3&\"]\"), \"=\", INDIRECT($A$1&\"[\"&C4&\"]\"), \"=\", INDIRECT($A$1&\"[\"&C5&\"]\"), \"=\", INDIRECT($A$1&\"[\"&C6&\"]\"), \"=\", INDIRECT($A$1&\"[\"&C7&\"]\"), \"=\", INDIRECT($A$1&\"[\"&C8&\"]\"), \"=\", INDIRECT($A$1&\"[\"&C9&\"]\"), \"=\", INDIRECT($A$1&\"[\"&C11&\"]\"), \"=\", INDIRECT($A$1&\"[\"&C12&\"]\"), \"=\", INDIRECT($A$1&\"[\"&C13&\"]\"), \"=\", INDIRECT($A$1&\"[\"&C14&\"]\"), \"=\", INDIRECT($A$1&\"[\"&C15&\"]\"), \"=\", INDIRECT($A$1&\"[\"&C16&\"]\"), \"=\", INDIRECT($A$1&\"[\"&C17&\"]\"), \"=\", INDIRECT($A$1&\"[\"&C18&\"]\"), \"=\", INDIRECT($A$1&\"[\"&C19&\"]\"), \"=\", INDIRECT($A$1&\"[\"&C20&\"]\"), \"=\", INDIRECT($A$1&\"[\"&C21&\"]\"), \"=\", INDIRECT($A$1&\"[\"&C22&\"]\"), \"=\")","v":{"$error":"#REF!"}},"blank rows",null,null,{"$f":"IF(src_blank=src_total, \"No Source/Impact Records\", IF(src_missing>0, \"Missing Mandatory Data\", IF(src_exceed>0, \"Text is too long\", \"Validation OK\")))","v":{"$error":"#REF!"}},null,null,null,"BORE_REGISTER",{"$f":"ROWS(INDIRECT(M1))-P1","v":0},"total rows (minus blank)",{"$f":"COUNTIFS(INDIRECT($M$1&\"[\"&O3&\"]\"), \"=\", INDIRECT($M$1&\"[\"&O4&\"]\"), \"=\", INDIRECT($M$1&\"[\"&O5&\"]\"), \"=\", INDIRECT($M$1&\"[\"&O6&\"]\"), \"=\", INDIRECT($M$1&\"[\"&O7&\"]\"), \"=\", INDIRECT($M$1&\"[\"&O8&\"]\"), \"=\", INDIRECT($M$1&\"[\"&O9&\"]\"), \"=\", INDIRECT($M$1&\"[\"&O10&\"]\"), \"=\", INDIRECT($M$1&\"[\"&O11&\"]\"), \"=\", INDIRECT($M$1&\"[\"&O12&\"]\"), \"=\", INDIRECT($M$1&\"[\"&O13&\"]\"), \"=\", INDIRECT($M$1&\"[\"&O14&\"]\"), \"=\", INDIRECT($M$1&\"[\"&O15&\"]\"), \"=\", INDIRECT($M$1&\"[\"&O16&\"]\"), \"=\", INDIRECT($M$1&\"[\"&O17&\"]\"), \"=\", INDIRECT($M$1&\"[\"&O18&\"]\"), \"=\", INDIRECT($M$1&\"[\"&O19&\"]\"), \"=\", INDIRECT($M$1&\"[\"&O20&\"]\"), \"=\")","v":9},"blank rows",null,null,null,{"$f":"IF(bore_blank=bore_total, \"No Bore Records\", IF(bore_missing>0, \"Missing Mandatory Data\", IF(bore_exceed>0, \"Text is too long\", IF(bore_text>0, \"Text in Number Column\",  \"Validation OK\"))))","v":"No Bore Records"}]
["field_name","id","title","type","length","mandatory","description","max_length","check_length","blank_rows","mandatory_check",null,"field_name","id","title","type","length","mandatory","description","max_length","check_length","blank_rows","mandatory_check","number fields with text"]
["record_type",1,{"$f":"INDEX(#REF!, validate_Source[[#This Row],[id]])","v":{"$error":"#REF!"}},"Dropdown",null,"Y",{"$f":"D3 & IF(ISBLANK(E3), \"\", \" (\" & E3 &\" characters)\") & IF(ISBLANK(validate_Source[[#This Row],[mandatory]]), \"\", \"*\")","v":"Dropdown*"},{"$f":"MAX(LEN(INDIRECT($A$1&\"[\"&validate_Source[[#This Row],[title]]&\"]\")))","v":{"$error":"#REF!"}},{"$f":"IF(OR(ISBLANK(validate_Source[[#This Row],[length]]), ISBLANK(validate_Source[[#This Row],[max_length]]),  validate_Source[[#This Row],[max_length]]<validate_Source[[#This Row],[length]]), 0, 1)","v":{"$error":"#REF!"}},{"$f":"COUNTBLANK(INDIRECT($A$1&\"[\"&C3&\"]\"))-$E$1","v":{"$error":"#REF!"}},{"$f":"IF(AND(validate_Source[[#This Row],[mandatory]]=\"Y\", validate_Source[[#This Row],[blank_rows]]<=$C$1, validate_Source[[#This Row],[blank_rows]]>0), 1, 0)","v":{"$error":"#REF!"}},null,"record_type",1,{"$f":"INDEX(BORE_REGISTER[#Headers], validate_Bores[[#This Row],[id]])","v":"Does this Bore record replace an existing Bore ID?"},"Dropdown",null,"Y",{"$f":"P3 & IF(ISBLANK(Q3), \"\", \" (\" & Q3 &\" characters)\") & IF(ISBLANK(validate_Bores[[#This Row],[mandatory]]), \"\", \"*\")","v":"Dropdown*"},{"$f":"MAX(LEN(INDIRECT($M$1&\"[\"&validate_Bores[[#This Row],[title]]&\"]\")))","v":0},{"$f":"IF(OR(ISBLANK(validate_Bores[[#This Row],[length]]), ISBLANK(validate_Bores[[#This Row],[max_length]]),  validate_Bores[[#This Row],[max_length]]<validate_Bores[[#This Row],[length]]), 0, 1)","v":0},{"$f":"COUNTBLANK(INDIRECT($M$1&\"[\"&O3&\"]\"))-$P$1","v":0},{"$f":"IF(AND(validate_Bores[[#This Row],[mandatory]]=\"Y\", validate_Bores[[#This Row],[blank_rows]]<=$N$1, validate_Bores[[#This Row],[blank_rows]]>0), 1, 0)","v":0}]
["source_id",2,{"$f":"INDEX(#REF!, validate_Source[[#This Row],[id]])","v":{"$error":"#REF!"}},"Whole Number",null,null,{"$f":"D4 & IF(ISBLANK(E4), \"\", \" (\" & E4 &\" characters)\") & IF(ISBLANK(validate_Source[[#This Row],[mandatory]]), \"\", \"*\")","v":"Whole Number"},{"$f":"MAX(LEN(INDIRECT($A$1&\"[\"&validate_Source[[#This Row],[title]]&\"]\")))","v":{"$error":"#REF!"}},{"$f":"IF(OR(ISBLANK(validate_Source[[#This Row],[length]]), ISBLANK(validate_Source[[#This Row],[max_length]]),  validate_Source[[#This Row],[max_length]]<validate_Source[[#This Row],[length]]), 0, 1)","v":{"$error":"#REF!"}},{"$error":"#REF!"},{"$f":"IF(AND(validate_Source[[#This Row],[mandatory]]=\"Y\", validate_Source[[#This Row],[blank_rows]]<=$C$1, validate_Source[[#This Row],[blank_rows]]>0), 1, 0)","v":{"$error":"#REF!"}},null,"bore_id",2,{"$f":"INDEX(BORE_REGISTER[#Headers], validate_Bores[[#This Row],[id]])","v":"CHAMP BORE ID\n(if the record replaces an existing bore)"},"Whole Number",null,null,{"$f":"P4 & IF(ISBLANK(Q4), \"\", \" (\" & Q4 &\" characters)\") & IF(ISBLANK(validate_Bores[[#This Row],[mandatory]]), \"\", \"*\")","v":"Whole Number"},{"$f":"MAX(LEN(INDIRECT($M$1&\"[\"&validate_Bores[[#This Row],[title]]&\"]\")))","v":0},{"$f":"IF(OR(ISBLANK(validate_Bores[[#This Row],[length]]), ISBLANK(validate_Bores[[#This Row],[max_length]]),  validate_Bores[[#This Row],[max_length]]<validate_Bores[[#This Row],[length]]), 0, 1)","v":0},0,{"$f":"IF(AND(validate_Bores[[#This Row],[mandatory]]=\"Y\", validate_Bores[[#This Row],[blank_rows]]<=$N$1, validate_Bores[[#This Row],[blank_rows]]>0), 1, 0)","v":0},{"$f":"IF(AND(validate_Bores[[#This Row],[blank_rows]]<>$V$22, ISNUMBER(AVERAGE(INDIRECT($M$1&\"[\"&validate_Bores[[#This Row],[title]]&\"]\")))=FALSE), 1, 0)","v":0}]
["site_desc",3,{"$f":"INDEX(#REF!, validate_Source[[#This Row],[id]])","v":{"$error":"#REF!"}},"Dropdown",null,"Y",{"$f":"D5 & IF(ISBLANK(E5), \"\", \" (\" & E5 &\" characters)\") & IF(ISBLANK(validate_Source[[#This Row],[mandatory]]), \"\", \"*\")","v":"Dropdown*"},{"$f":"MAX(LEN(INDIRECT($A$1&\"[\"&validate_Source[[#This Row],[title]]&\"]\")))","v":{"$error":"#REF!"}},{"$f":"IF(OR(ISBLANK(validate_Source[[#This Row],[length]]), ISBLANK(validate_Source[[#This Row],[max_length]]),  validate_Source[[#This Row],[max_length]]<validate_Source[[#This Row],[length]]), 0, 1)","v":{"$error":"#REF!"}},{"$error":"#REF!"},{"$f":"IF(AND(validate_Source[[#This Row],[mandatory]]=\"Y\", validate_Source[[#This Row],[blank_rows]]<=$C$1, validate_Source[[#This Row],[blank_rows]]>0), 1, 0)","v":{"$error":"#REF!"}},null,"bore_name",3,{"$f":"INDEX(BORE_REGISTER[#Headers], validate_Bores[[#This Row],[id]])","v":"Unique Bore ID"},"Free text",50,"Y",{"$f":"P5 & IF(ISBLANK(Q5), \"\", \" (\" & Q5 &\" characters)\") & IF(ISBLANK(validate_Bores[[#This Row],[mandatory]]), \"\", \"*\")","v":"Free text (50 characters)*"},{"$f":"MAX(LEN(INDIRECT($M$1&\"[\"&validate_Bores[[#This Row],[title]]&\"]\")))","v":0},{"$f":"IF(OR(ISBLANK(validate_Bores[[#This Row],[length]]), ISBLANK(validate_Bores[[#This Row],[max_length]]),  validate_Bores[[#This Row],[max_length]]<validate_Bores[[#This Row],[length]]), 0, 1)","v":0},0,{"$f":"IF(AND(validate_Bores[[#This Row],[mandatory]]=\"Y\", validate_Bores[[#This Row],[blank_rows]]<=$N$1, validate_Bores[[#This Row],[blank_rows]]>0), 1, 0)","v":0}]
["lot_desc",4,{"$f":"INDEX(#REF!, validate_Source[[#This Row],[id]])","v":{"$error":"#REF!"}},"Free text",1000,null,{"$f":"D6 & IF(ISBLANK(E6), \"\", \" (\" & E6 &\" characters)\") & IF(ISBLANK(validate_Source[[#This Row],[mandatory]]), \"\", \"*\")","v":"Free text (1000 characters)"},{"$f":"MAX(LEN(INDIRECT($A$1&\"[\"&validate_Source[[#This Row],[title]]&\"]\")))","v":{"$error":"#REF!"}},{"$f":"IF(OR(ISBLANK(validate_Source[[#This Row],[length]]), ISBLANK(validate_Source[[#This Row],[max_length]]),  validate_Source[[#This Row],[max_length]]<validate_Source[[#This Row],[length]]), 0, 1)","v":{"$error":"#REF!"}},{"$error":"#REF!"},{"$f":"IF(AND(validate_Source[[#This Row],[mandatory]]=\"Y\", validate_Source[[#This Row],[blank_rows]]<=$C$1, validate_Source[[#This Row],[blank_rows]]>0), 1, 0)","v":{"$error":"#REF!"}},null,"bore_type",4,{"$f":"INDEX(BORE_REGISTER[#Headers], validate_Bores[[#This Row],[id]])","v":"Bore Type"},"Dropdown",null,"Y",{"$f":"P6 & IF(ISBLANK(Q6), \"\", \" (\" & Q6 &\" characters)\") & IF(ISBLANK(validate_Bores[[#This Row],[mandatory]]), \"\", \"*\")","v":"Dropdown*"},{"$f":"MAX(LEN(INDIRECT($M$1&\"[\"&validate_Bores[[#This Row],[title]]&\"]\")))","v":0},{"$f":"IF(OR(ISBLANK(validate_Bores[[#This Row],[length]]), ISBLANK(validate_Bores[[#This Row],[max_length]]),  validate_Bores[[#This Row],[max_length]]<validate_Bores[[#This Row],[length]]), 0, 1)","v":0},0,{"$f":"IF(AND(validate_Bores[[#This Row],[mandatory]]=\"Y\", validate_Bores[[#This Row],[blank_rows]]<=$N$1, validate_Bores[[#This Row],[blank_rows]]>0), 1, 0)","v":0}]
["lease_status",5,{"$f":"INDEX(#REF!, validate_Source[[#This Row],[id]])","v":{"$error":"#REF!"}},"Dropdown",null,null,{"$f":"D7 & IF(ISBLANK(E7), \"\", \" (\" & E7 &\" characters)\") & IF(ISBLANK(validate_Source[[#This Row],[mandatory]]), \"\", \"*\")","v":"Dropdown"},{"$f":"MAX(LEN(INDIRECT($A$1&\"[\"&validate_Source[[#This Row],[title]]&\"]\")))","v":{"$error":"#REF!"}},{"$f":"IF(OR(ISBLANK(validate_Source[[#This Row],[length]]), ISBLANK(validate_Source[[#This Row],[max_length]]),  validate_Source[[#This Row],[max_length]]<validate_Source[[#This Row],[length]]), 0, 1)","v":{"$error":"#REF!"}},{"$error":"#REF!"},{"$f":"IF(AND(validate_Source[[#This Row],[mandatory]]=\"Y\", validate_Source[[#This Row],[blank_rows]]<=$C$1, validate_Source[[#This Row],[blank_rows]]>0), 1, 0)","v":{"$error":"#REF!"}},null,"bore_owner",5,{"$f":"INDEX(BORE_REGISTER[#Headers], validate_Bores[[#This Row],[id]])","v":"Bore Owner"},"Free text",100,"Y",{"$f":"P7 & IF(ISBLANK(Q7), \"\", \" (\" & Q7 &\" characters)\") & IF(ISBLANK(validate_Bores[[#This Row],[mandatory]]), \"\", \"*\")","v":"Free text (100 characters)*"},{"$f":"MAX(LEN(INDIRECT($M$1&\"[\"&validate_Bores[[#This Row],[title]]&\"]\")))","v":0},{"$f":"IF(OR(ISBLANK(validate_Bores[[#This Row],[length]]), ISBLANK(validate_Bores[[#This Row],[max_length]]),  validate_Bores[[#This Row],[max_length]]<validate_Bores[[#This Row],[length]]), 0, 1)","v":0},0,{"$f":"IF(AND(validate_Bores[[#This Row],[mandatory]]=\"Y\", validate_Bores[[#This Row],[blank_rows]]<=$N$1, validate_Bores[[#This Row],[blank_rows]]>0), 1, 0)","v":0}]
["alias_id",6,{"$f":"INDEX(#REF!, validate_Source[[#This Row],[id]])","v":{"$error":"#REF!"}},"Free text",100,"Y",{"$f":"D8 & IF(ISBLANK(E8), \"\", \" (\" & E8 &\" characters)\") & IF(ISBLANK(validate_Source[[#This Row],[mandatory]]), \"\", \"*\")","v":"Free text (100 characters)*"},{"$f":"MAX(LEN(INDIRECT($A$1&\"[\"&validate_Source[[#This Row],[title]]&\"]\")))","v":{"$error":"#REF!"}},{"$f":"IF(OR(ISBLANK(validate_Source[[#This Row],[length]]), ISBLANK(validate_Source[[#This Row],[max_length]]),  validate_Source[[#This Row],[max_length]]<validate_Source[[#This Row],[length]]), 0, 1)","v":{"$error":"#REF!"}},{"$error":"#REF!"},{"$f":"IF(AND(validate_Source[[#This Row],[mandatory]]=\"Y\", validate_Source[[#This Row],[blank_rows]]<=$C$1, validate_Source[[#This Row],[blank_rows]]>0), 1, 0)","v":{"$error":"#REF!"}},null,"bore_status",6,{"$f":"INDEX(BORE_REGISTER[#Headers], validate_Bores[[#This Row],[id]])","v":"Bore Status"},"Dropdown",null,"Y",{"$f":"P8 & IF(ISBLANK(Q8), \"\", \" (\" & Q8 &\" characters)\") & IF(ISBLANK(validate_Bores[[#This Row],[mandatory]]), \"\", \"*\")","v":"Dropdown*"},{"$f":"MAX(LEN(INDIRECT($M$1&\"[\"&validate_Bores[[#This Row],[title]]&\"]\")))","v":0},{"$f":"IF(OR(ISBLANK(validate_Bores[[#This Row],[length]]), ISBLANK(validate_Bores[[#This Row],[max_length]]),  validate_Bores[[#This Row],[max_length]]<validate_Bores[[#This Row],[length]]), 0, 1)","v":0},0,{"$f":"IF(AND(validate_Bores[[#This Row],[mandatory]]=\"Y\", validate_Bores[[#This Row],[blank_rows]]<=$N$1, validate_Bores[[#This Row],[blank_rows]]>0), 1, 0)","v":0}]
["label",7,{"$f":"INDEX(#REF!, validate_Source[[#This Row],[id]])","v":{"$error":"#REF!"}},"Free text",300,"Y",{"$f":"D9 & IF(ISBLANK(E9), \"\", \" (\" & E9 &\" characters)\") & IF(ISBLANK(validate_Source[[#This Row],[mandatory]]), \"\", \"*\")","v":"Free text (300 characters)*"},{"$f":"MAX(LEN(INDIRECT($A$1&\"[\"&validate_Source[[#This Row],[title]]&\"]\")))","v":{"$error":"#REF!"}},{"$f":"IF(OR(ISBLANK(validate_Source[[#This Row],[length]]), ISBLANK(validate_Source[[#This Row],[max_length]]),  validate_Source[[#This Row],[max_length]]<validate_Source[[#This Row],[length]]), 0, 1)","v":{"$error":"#REF!"}},{"$error":"#REF!"},{"$f":"IF(AND(validate_Source[[#This Row],[mandatory]]=\"Y\", validate_Source[[#This Row],[blank_rows]]<=$C$1, validate_Source[[#This Row],[blank_rows]]>0), 1, 0)","v":{"$error":"#REF!"}},null,"license_id",7,{"$f":"INDEX(BORE_REGISTER[#Headers], validate_Bores[[#This Row],[id]])","v":"BCL ID"},"Free text",20,null,{"$f":"P9 & IF(ISBLANK(Q9), \"\", \" (\" & Q9 &\" characters)\") & IF(ISBLANK(validate_Bores[[#This Row],[mandatory]]), \"\", \"*\")","v":"Free text (20 characters)"},{"$f":"MAX(LEN(INDIRECT($M$1&\"[\"&validate_Bores[[#This Row],[title]]&\"]\")))","v":0},{"$f":"IF(OR(ISBLANK(validate_Bores[[#This Row],[length]]), ISBLANK(validate_Bores[[#This Row],[max_length]]),  validate_Bores[[#This Row],[max_length]]<validate_Bores[[#This Row],[length]]), 0, 1)","v":0},0,{"$f":"IF(AND(validate_Bores[[#This Row],[mandatory]]=\"Y\", validate_Bores[[#This Row],[blank_rows]]<=$N$1, validate_Bores[[#This Row],[blank_rows]]>0), 1, 0)","v":0}]
["historical_name",8,{"$f":"INDEX(#REF!, validate_Source[[#This Row],[id]])","v":{"$error":"#REF!"}},"Free text",300,null,{"$f":"D10 & IF(ISBLANK(E10), \"\", \" (\" & E10 &\" characters)\") & IF(ISBLANK(validate_Source[[#This Row],[mandatory]]), \"\", \"*\")","v":"Free text (300 characters)"},{"$f":"MAX(LEN(INDIRECT($A$1&\"[\"&validate_Source[[#This Row],[title]]&\"]\")))","v":{"$error":"#REF!"}},{"$f":"IF(OR(ISBLANK(validate_Source[[#This Row],[length]]), ISBLANK(validate_Source[[#This Row],[max_length]]),  validate_Source[[#This Row],[max_length]]<validate_Source[[#This Row],[length]]), 0, 1)","v":{"$error":"#REF!"}},{"$f":"COUNTBLANK(INDIRECT($A$1&\"[\"&C10&\"]\"))-$E$1","v":{"$error":"#REF!"}},{"$f":"IF(AND(validate_Source[[#This Row],[mandatory]]=\"Y\", validate_Source[[#This Row],[blank_rows]]<=$C$1, validate_Source[[#This Row],[blank_rows]]>0), 1, 0)","v":{"$error":"#REF!"}},null,"headworks",8,{"$f":"INDEX(BORE_REGISTER[#Headers], validate_Bores[[#This Row],[id]])","v":"Headworks"},"Dropdown",null,null,{"$f":"P10 & IF(ISBLANK(Q10), \"\", \" (\" & Q10 &\" characters)\") & IF(ISBLANK(validate_Bores[[#This Row],[mandatory]]), \"\", \"*\")","v":"Dropdown"},{"$f":"MAX(LEN(INDIRECT($M$1&\"[\"&validate_Bores[[#This Row],[title]]&\"]\")))","v":0},{"$f":"IF(OR(ISBLANK(validate_Bores[[#This Row],[length]]), ISBLANK(validate_Bores[[#This Row],[max_length]]),  validate_Bores[[#This Row],[max_length]]<validate_Bores[[#This Row],[length]]), 0, 1)","v":0},0,{"$f":"IF(AND(validate_Bores[[#This Row],[mandatory]]=\"Y\", validate_Bores[[#This Row],[blank_rows]]<=$N$1, validate_Bores[[#This Row],[blank_rows]]>0), 1, 0)","v":0}]
{"$rows_left_out":37}